{"text_format":"1","workbook":"xlsx","n_sheets":7,"sheets":["Don vi ","Codinh","Taxi","Hopdong","Congtenno","Daukeo","Tai"],"not_rendered":{"charts":0,"images":0,"macros":1,"external_links":1,"defined_names":8,"comments":1,"pivot_tables":0},"unopened":[],"bounds":{"document_bytes":16777216,"sheet_cells":100000,"rows_first":2000,"rows_last":500,"rows_between":2000,"halvings":0,"cell_chars":16384,"cell_head_chars":4096},"cells_cut":0,"cells_raw":0,"read":"whole","date_system":"1900"}

{"sheet":"Don vi ","index":0,"n_rows":8,"n_cols":8,"rows_kept":8,"cut":false,"hidden":false,"merged":[[0,0,0,7],[1,0,1,7]]}
["PHỤ LỤC 1"]
["(Kèm theo Công văn số          /SGTVT-QLVT ngày       /6/2021 của Sở GTVT Quảng Bình)"]
[]
["Số GPKD","CẤP LẦN THỨ","CẤP CHO ĐƠN VỊ","ĐỊA CHỈ","Họ và tên người đại diện hợp pháp","CÁC LOẠI HÌNH KDVT BẰNG Ô TÔ","NGÀY CẤP","CÓ GIÁ TRỊ ĐẾN"]
[442102160,1,"Công ty TNHH Vận tải Hà Chi","Số 296 Lý Thánh Tông, Xã Lộc Ninh, TP Đồng Hới, Tỉnh Quảng Bình","Đoàn Thị Hà","Kinh doanh vận tải hành khách theo hợp đồng","2021-06-14"]
[442112368,1,"Hợp tác xã Vận tải và Du lịch Á Châu","Số 16 Nguyễn Du, Phường Đồng Hải, TP Đồng Hới, Tỉnh Quảng Bình","Lê Mỹ Linh","Kinh doanh vận tải hành khách theo hợp đồng","2021-06-10"]
[442112268,1,"Hợp tác xã dịch vụ vận tải Thắng Nguyễn","Tổ dân phố 1, Phường Bắc Lý, TP Đồng Hới, Tỉnh Quảng Bình","Nguyễn Quyết Thắng","Kinh doanh vận tải hành khách theo hợp đồng","2021-06-07"]
[442102156,2,"Công ty TNHH TMVT&DL Thanh Long","Thôn 12, Xã Lộc Ninh, TP Đồng Hới, Tỉnh Quảng Bình","Trần Thanh Long","Kinh doanh vận tải hành khách theo hợp đồng","2021-05-17"]

{"sheet":"Codinh","index":1,"n_rows":7,"n_cols":7,"rows_kept":7,"cut":false,"hidden":false,"merged":[]}
["PHỤ LỤC 2"]
["(Kèm theo Công văn số          /SGTVT-QLVT ngày       /6/2021của Sở GTVT Quảng Bình)"]
[]
["STT","Biển KS","Tên đơn vị","Loại hình ","Số ghế","Phù hiệu có giá trị đến","Ghi chú"]
[{"$f":"IF($B5<>\"\",SUBTOTAL(103,B$5:B5),\"\")","v":1},"73F00005","HTX VẬN TẢI PHÚ THÀNH TUYÊN MINH","Xe tuyến cố định","16","2022-05-25"]
[{"$f":"IF($B6<>\"\",SUBTOTAL(103,B$5:B6),\"\")","v":2},"73B00914","CÔNG TY CP VẬN TẢI Ô TÔ QUẢNG BÌNH","Xe tuyến cố định","29","2022-05-25"]
[{"$f":"IF($B7<>\"\",SUBTOTAL(103,B$5:B7),\"\")","v":3},"73F00002","HTX VẬN TẢI PHÚ THÀNH TUYÊN MINH","Xe tuyến cố định","16","2022-05-14"]

{"sheet":"Taxi","index":2,"n_rows":8,"n_cols":7,"rows_kept":8,"cut":false,"hidden":false,"merged":[]}
["PHỤ LỤC 4"]
["(Kèm theo Công văn số          /SGTVT-QLVT ngày       /6/2021của Sở GTVT Quảng Bình)"]
[]
["STT","Biển KS","Tên đơn vị","Loại hình","Số ghế","Phù hiệu có giá trị đến","Ghi chú"]
[1,"73A16528","CHI NHÁNH HTX HÒA BÌNH XANH TẠI QUẢNG BÌNH","Xe taxi","5","2022-06-11"]
[2,"73A15301","CHI NHÁNH HTX HÒA BÌNH XANH TẠI QUẢNG BÌNH","Xe taxi","5","2022-06-11"]
[3,"73A05835","CÔNG TY CỔ PHẦN VẬN TẢI PHÚ HOÀNG","Xe taxi","5","2022-06-03"]
[4,"73E00064","CÔNG TY TNHH MAI LINH QUẢNG BÌNH","Xe taxi","5","2022-05-17"]

{"sheet":"Hopdong","index":3,"n_rows":18,"n_cols":13,"rows_kept":18,"cut":false,"hidden":false,"merged":[]}
["PHỤ LỤC 5",null,null,null,null,null,null,null,null,"Từ ngày","Đến ngày"]
["(Kèm theo Công văn số          /SGTVT-QLVT ngày       /6/2021của Sở GTVT Quảng Bình)",null,null,null,null,null,null,null,null,"2020-09-15","2020-10-15",null,"Xe hợp đồng"]
[]
["STT","Biển KS","Tên đơn vị","Loại hình","Số ghế","Phù hiệu có giá trị đến","Ghi chú"]
[1,"73B01102","HTX DV HTVT ĐƯỜNG BỘ ĐỒNG HỚI","Xe hợp đồng","29","2022-06-14"]
[2,"73B01129","HTX DV HTVT ĐƯỜNG BỘ ĐỒNG HỚI","Xe hợp đồng","16","2022-06-14"]
[3,"73A17322","HỢP TÁC XÃ VẬN TẢI - CÔNG NGHỆ QUẢNG BÌNH","Xe hợp đồng","5","2022-06-14"]
[4,"73A12696","HỢP TÁC XÃ VẬN TẢI VÀ DU LỊCH Á CHÂU","Xe hợp đồng","5","2022-06-14"]
[5,"73B01109","CÔNG TY TNHH TUẤN KIỆT ANH HÙNG","Xe du lịch","16","2022-06-14"]
[6,"73B00669","HTX DV HTVT ĐƯỜNG BỘ ĐỒNG HỚI","Xe hợp đồng","29","2022-06-10"]
[7,"73B00639","HTX DV HTVT ĐƯỜNG BỘ ĐỒNG HỚI","Xe hợp đồng","16","2022-06-10"]
[8,"73F00034","HỢP TÁC XÃ VẬN TẢI VÀ DU LỊCH Á CHÂU","Xe hợp đồng","5","2022-06-04"]
[9,"73B00768","CÔNG TY TNHH VTDL MINH HOÀNG","Xe hợp đồng","29","2022-06-04"]
[10,"73B00761","CÔNG TY TNHH VT&TM NAM HÀ","Xe hợp đồng","16","2022-06-04"]
[11,"73B00835","CÔNG TY TNHH VT&TM NAM HÀ","Xe hợp đồng","16","2022-06-04"]
[12,"73F00046","HTX VẬN TẢI PHÚ THÀNH TUYÊN MINH","Xe hợp đồng","16","2022-05-27"]
[13,"73B01004","HTX VẬN TẢI PHÚ THÀNH TUYÊN MINH","Xe hợp đồng","16","2022-05-27"]
[14,"73B00797","HTX DV HTVT ĐƯỜNG BỘ ĐỒNG HỚI","Xe hợp đồng","16","2022-05-18"]

{"sheet":"Congtenno","index":4,"n_rows":10,"n_cols":7,"rows_kept":10,"cut":false,"hidden":false,"merged":[]}
["PHỤ LỤC 7"]
["(Kèm theo Công văn số          /SGTVT-QLVT ngày       /6/2020 của Sở GTVT Quảng Bình)"]
[]
["STT","Biển KS","Tên đơn vị","Loại hình","Tải trọng","Phù hiệu có giá trị đến","Ghi chú"]
[{"$f":"IF($B5<>\"\",SUBTOTAL(103,B$5:B5),\"\")","v":1},"73H00262",{"$f":"IFERROR(VLOOKUP(B5,[1]TBGSHT!$B$9:$G$4432,3,0),\"\")","v":"HTX DV HTVT ĐƯỜNG BỘ ĐỒNG HỚI"},{"$f":"IFERROR(VLOOKUP(B5,[1]TBGSHT!$B$9:$G$4432,2,0),\"\")","v":"Xe Container"},{"$f":"IFERROR(VLOOKUP(B5,[1]TBGSHT!$B$9:$G$4432,5,0),\"\")","v":"14.250,00"},{"$f":"_xlfn.XLOOKUP(B5,[1]Phuhieu!$F$3:$F$2662,[1]Phuhieu!$E$3:$E$2662)","v":"2022-05-31"}]
[{"$f":"IF($B6<>\"\",SUBTOTAL(103,B$5:B6),\"\")","v":2},"73H00117",{"$f":"IFERROR(VLOOKUP(B6,[1]TBGSHT!$B$9:$G$4432,3,0),\"\")","v":"CÔNG TY CỔ PHẦN SƠN THÀNH TÂM"},{"$f":"IFERROR(VLOOKUP(B6,[1]TBGSHT!$B$9:$G$4432,2,0),\"\")","v":"Xe Container"},{"$f":"IFERROR(VLOOKUP(B6,[1]TBGSHT!$B$9:$G$4432,5,0),\"\")","v":"13.970,00"},{"$f":"_xlfn.XLOOKUP(B6,[1]Phuhieu!$F$3:$F$2662,[1]Phuhieu!$E$3:$E$2662)","v":"2022-05-27"}]
[{"$f":"IF($B7<>\"\",SUBTOTAL(103,B$5:B7),\"\")","v":3},"73H00104",{"$f":"IFERROR(VLOOKUP(B7,[1]TBGSHT!$B$9:$G$4432,3,0),\"\")","v":"CÔNG TY CỔ PHẦN SƠN THÀNH TÂM"},{"$f":"IFERROR(VLOOKUP(B7,[1]TBGSHT!$B$9:$G$4432,2,0),\"\")","v":"Xe Container"},{"$f":"IFERROR(VLOOKUP(B7,[1]TBGSHT!$B$9:$G$4432,5,0),\"\")","v":"13.970,00"},{"$f":"_xlfn.XLOOKUP(B7,[1]Phuhieu!$F$3:$F$2662,[1]Phuhieu!$E$3:$E$2662)","v":"2022-05-27"}]
[{"$f":"IF($B8<>\"\",SUBTOTAL(103,B$5:B8),\"\")","v":4},"73H00163",{"$f":"IFERROR(VLOOKUP(B8,[1]TBGSHT!$B$9:$G$4432,3,0),\"\")","v":"CÔNG TY TNHH HẢI VÂN"},{"$f":"IFERROR(VLOOKUP(B8,[1]TBGSHT!$B$9:$G$4432,2,0),\"\")","v":"Xe Container"},{"$f":"IFERROR(VLOOKUP(B8,[1]TBGSHT!$B$9:$G$4432,5,0),\"\")","v":"14.250,00"},{"$f":"_xlfn.XLOOKUP(B8,[1]Phuhieu!$F$3:$F$2662,[1]Phuhieu!$E$3:$E$2662)","v":"2022-05-20"}]
[{"$f":"IF($B9<>\"\",SUBTOTAL(103,B$5:B9),\"\")","v":5},"73C10393",{"$f":"IFERROR(VLOOKUP(B9,[1]TBGSHT!$B$9:$G$4432,3,0),\"\")","v":"HTX DV HTVT ĐƯỜNG BỘ ĐỒNG HỚI"},{"$f":"IFERROR(VLOOKUP(B9,[1]TBGSHT!$B$9:$G$4432,2,0),\"\")","v":"Xe Container"},{"$f":"IFERROR(VLOOKUP(B9,[1]TBGSHT!$B$9:$G$4432,5,0),\"\")","v":"15.156,00"},{"$f":"_xlfn.XLOOKUP(B9,[1]Phuhieu!$F$3:$F$2662,[1]Phuhieu!$E$3:$E$2662)","v":"2022-05-19"}]
[{"$f":"IF($B10<>\"\",SUBTOTAL(103,B$5:B10),\"\")","v":""},null,{"$f":"IFERROR(VLOOKUP(B10,[1]TBGSHT!$B$9:$G$4432,3,0),\"\")","v":""},{"$f":"IFERROR(VLOOKUP(B10,[1]TBGSHT!$B$9:$G$4432,2,0),\"\")","v":""},{"$f":"IFERROR(VLOOKUP(B10,[1]TBGSHT!$B$9:$G$4432,5,0),\"\")","v":""}]

{"sheet":"Daukeo","index":5,"n_rows":16,"n_cols":7,"rows_kept":16,"cut":false,"hidden":false,"merged":[]}
["PHỤ LỤC 8"]
["(Kèm theo Công văn số          /SGTVT-QLVT ngày       /6/2021 của Sở GTVT Quảng Bình)"]
[]
["STT","Biển KS","Tên đơn vị","Loại hình","Tải trọng","Phù hiệu có giá trị đến","Ghi chú"]
[1,"73H00148","HTX DV HTVT ĐƯỜNG BỘ ĐỒNG HỚI","Xe đầu kéo","13.420,00","2022-06-04"]
[2,"73H00253","HTX CƠ KHÍ & VẬN TẢI Ô TÔ HUY HOÀNG","Xe đầu kéo","14.270,00","2022-06-04"]
[3,"73H00131","HTX DV HTVT ĐƯỜNG BỘ ĐỒNG HỚI","Xe đầu kéo","13.220,00","2022-06-03"]
[4,"73H00116","HTX DV HTVT ĐƯỜNG BỘ ĐỒNG HỚI","Xe đầu kéo","13.220,00","2022-06-03"]
[5,"73H00154","HTX DV HTVT ĐƯỜNG BỘ ĐỒNG HỚI","Xe đầu kéo","13.220,00","2022-06-03"]
[6,"73H00103","HTX DV HTVT ĐƯỜNG BỘ ĐỒNG HỚI","Xe đầu kéo","14.250,00","2022-06-02"]
[7,"73H00053","HTX DV HTVT ĐƯỜNG BỘ ĐỒNG HỚI","Xe đầu kéo","14.250,00","2022-05-28"]
[8,"73H00196","HTX DV HTVT ĐƯỜNG BỘ ĐỒNG HỚI","Xe đầu kéo","13.570,00","2022-05-28"]
[9,"73H00183","CÔNG TY TNHH XDTH BÌNH AN","Xe đầu kéo","14.070,00","2022-05-27"]
[10,"73H00137","HTX DV HTVT ĐƯỜNG BỘ ĐỒNG HỚI","Xe đầu kéo","13.220,00","2022-05-24"]
[11,"73H00112","HTX DV HTVT ĐƯỜNG BỘ ĐỒNG HỚI","Xe đầu kéo","13.220,00","2022-05-24"]
[12,"73H00121","CÔNG TY TNHH TM QUY HƯƠNG","Xe đầu kéo","38.450,00","2022-05-17"]

{"sheet":"Tai","index":6,"n_rows":45,"n_cols":7,"rows_kept":45,"cut":false,"hidden":false,"merged":[]}
["PHỤ LỤC 9"]
["(Kèm theo Công văn số          /SGTVT-QLVT ngày       /6/2021 của Sở GTVT Quảng Bình)"]
[]
["STT","Biển KS","Tên đơn vị","Loại hình","Tải trọng","Phù hiệu có giá trị đến","Ghi chú"]
[1,"73C03946","HTX DV HTVT ĐƯỜNG BỘ ĐỒNG HỚI","Xe tải","16.300,00","2022-06-14"]
[2,"73H00189","CÔNG TY TNHH VT&TM HÒA PHÁT","Xe tải","13.350,00","2022-06-11"]
[3,"73H00264","CÔNG TY TNHH TM LÊ DŨNG LINH","Xe tải","17.900,00","2022-06-11"]
[4,"73H00165","CÔNG TY TNHH VT&TM HÒA PHÁT","Xe tải","13.350,00","2022-06-11"]
[5,"73C11413","HTX DV HTVT ĐƯỜNG BỘ ĐỒNG HỚI","Xe tải","900,00","2022-06-10"]
[6,"73H00120","HTX DV HTVT ĐƯỜNG BỘ ĐỒNG HỚI","Xe tải","8.570,00","2022-06-09"]
[7,"73H00146","HTX DV HTVT ĐƯỜNG BỘ ĐỒNG HỚI","Xe tải","8.670,00","2022-06-03"]
[8,"73H00142","CÔNG TY TNHH TMVT BÌNH HƯỜNG","Xe tải","16.050,00","2022-06-01"]
[9,"73H00170","CÔNG TY TNHH TMVT BÌNH HƯỜNG","Xe tải","16.050,00","2022-06-01"]
[10,"73H00182","HTX DV HTVT ĐƯỜNG BỘ ĐỒNG HỚI","Xe tải","17.950,00","2022-05-31"]
[11,"73H00135","HTX DV HTVT ĐƯỜNG BỘ ĐỒNG HỚI","Xe tải","2.300,00","2022-05-28"]
[12,"73H00173","HTX DV HTVT ĐƯỜNG BỘ ĐỒNG HỚI","Xe tải","17.950,00","2022-05-27"]
[13,"73H00123","HTX DV HTVT ĐƯỜNG BỘ ĐỒNG HỚI","Xe tải","17.950,00","2022-05-27"]
[14,"73H00145","CÔNG TY TNHH TẬP ĐOÀN SƠN HẢI","Xe tải","16.000,00","2022-06-12"]
[15,"73H00106","CÔNG TY TNHH TẬP ĐOÀN SƠN HẢI","Xe tải","16.000,00","2022-06-12"]
[16,"73H00111","CÔNG TY TNHH TẬP ĐOÀN SƠN HẢI","Xe tải","16.000,00","2022-06-12"]
[17,"73H00147","CÔNG TY TNHH TẬP ĐOÀN SƠN HẢI","Xe tải","16.000,00","2022-06-12"]
[18,"73H00100","CÔNG TY TNHH TẬP ĐOÀN SƠN HẢI","Xe tải","16.000,00","2022-06-12"]
[19,"73H00180","CÔNG TY TNHH TẬP ĐOÀN SƠN HẢI","Xe tải","16.000,00","2022-06-12"]
[20,"73H00049","CÔNG TY TNHH TẬP ĐOÀN SƠN HẢI","Xe tải","16.000,00","2022-06-12"]
[21,"73H00158","CÔNG TY TNHH TẬP ĐOÀN SƠN HẢI","Xe tải","16.000,00","2022-06-12"]
[22,"73H00160","CÔNG TY TNHH TẬP ĐOÀN SƠN HẢI","Xe tải","16.000,00","2022-06-12"]
[23,"73H00169","CÔNG TY TNHH TẬP ĐOÀN SƠN HẢI","Xe tải","16.000,00","2022-06-12"]
[24,"73H00188","CÔNG TY TNHH TẬP ĐOÀN SƠN HẢI","Xe tải","16.000,00","2022-06-12"]
[25,"73H00149","CÔNG TY TNHH TẬP ĐOÀN SƠN HẢI","Xe tải","16.000,00","2022-06-12"]
[26,"73H00155","CÔNG TY TNHH TẬP ĐOÀN SƠN HẢI","Xe tải","16.000,00","2022-06-12"]
[27,"73H00133","CÔNG TY TNHH TẬP ĐOÀN SƠN HẢI","Xe tải","16.000,00","2022-06-12"]
[28,"73H00139","CÔNG TY TNHH TẬP ĐOÀN SƠN HẢI","Xe tải","16.000,00","2022-06-12"]
[29,"73C11313","HTX DỊCH VỤ HỖ TRỢ VT&HK HẢI ANH","Xe tải","16.200,00","2022-05-24"]
[30,"73H00164","CÔNG TY TNHH HẢI VÂN","Xe tải","16.300,00","2022-05-21"]
[31,"73H00143","CÔNG TY TNHH DVTM NGHĨA CẢNH","Xe tải","19.000,00","2023-01-21"]
[32,"73H00176","CÔNG TY TNHH TM TÀI VẸN","Xe tải","2.350,00","2022-05-21"]
[33,"73H00162","CÔNG TY TNHH HẢI VÂN","Xe tải","8.880,00","2024-05-20"]
[34,"73C08398","HTX DV HTVT ĐƯỜNG BỘ ĐỒNG HỚI","Xe tải","17.900,00","2022-05-20"]
[35,"73H00048","HTX VẬN TẢI PHÚ THÀNH TUYÊN MINH","Xe tải","17.900,00","2022-05-20"]
[36,"73H00141","CÔNG TY TNHH HẢI VÂN","Xe tải","16.200,00","2024-05-20"]
[37,"73H00151","CÔNG TY TNHH HẢI VÂN","Xe tải","16.700,00","2024-05-20"]
[38,"73C12904","HTX DV HTVT ĐƯỜNG BỘ ĐỒNG HỚI","Xe tải","6.300,00","2022-05-20"]
[39,"73C08912","HTX DV HTVT ĐƯỜNG BỘ ĐỒNG HỚI","Xe tải","9.200,00","2022-05-18"]
[40,"73C12900","HTX DV HTVT ĐƯỜNG BỘ ĐỒNG HỚI","Xe tải","2.400,00","2022-05-18"]
[41,"73C06828","CÔNG TY CPKD DẦU KHÍ QUẢNG BÌNH","Xe tải","2,27","2024-05-18"]